{"text_format":"1","workbook":"xlsx","n_sheets":10,"sheets":["初期設定","男子選手","記録入力","男子申込","データ貼付","データ完成","追加登録選手","計算①","学校番号","CSV"],"not_rendered":{"charts":0,"images":1,"macros":1,"external_links":0,"defined_names":1,"comments":1,"pivot_tables":0},"unopened":[],"bounds":{"document_bytes":16777216,"sheet_cells":100000,"rows_first":2000,"rows_last":500,"rows_between":2000,"halvings":0,"cell_chars":16384,"cell_head_chars":4096},"cells_cut":0,"cells_raw":0,"read":"whole","date_system":"1900"}

{"sheet":"初期設定","index":0,"n_rows":40,"n_cols":8,"rows_kept":40,"cut":false,"hidden":false,"merged":[[0,6,0,13],[17,0,37,0],[8,2,8,4],[1,2,1,4],[3,2,3,4],[4,2,4,4],[5,2,5,4],[6,2,6,4],[7,2,7,4]]}
[null,null,"初期設定シート",null,null,null,"まず学校番号を入力してください"]
[null,"学校名",{"$f":"IFERROR(VLOOKUP(初期設定!C4,学校番号!A3:B50,2,FALSE),\"\")","v":""}]
[null,"略称",{"$f":"IFERROR(VLOOKUP(初期設定!C4,学校番号!A3:D50,4,FALSE),\"\")","v":""},null,null,null,null,"①初期設定シートに必要事項を入力（セルが赤色）"]
[null,"学校番号",null,null,null,null,null,"②男子選手シートに選手情報を入力（ＣＳＶ読み込み）"]
[null,"郵便番号",{"$f":"IFERROR(VLOOKUP($C$4,学校番号!$A$3:$G$50,5,FALSE),\"\")","v":""},null,null,null,null,"③記録入力シートに各種目出場者データを入力（登録番号、記録）"]
[null,"電話番号",{"$f":"IFERROR(VLOOKUP($C$4,学校番号!$A$3:$G$50,7,FALSE),\"\")","v":""},null,null,null,null,"④記録入力シート一覧表ボタンをクリック"]
[null,"住所",{"$f":"IFERROR(VLOOKUP($C$4,学校番号!$A$3:$G$50,6,FALSE),\"\")","v":""},null,null,null,null,"⑤一覧表を印刷"]
[null,"学校長氏名"]
{"$rows_left_out":33}
{"sheet":"男子選手","index":1,"n_rows":107,"n_cols":16,"rows_kept":107,"cut":false,"hidden":false,"merged":[]}
[]
[]
[]
[null,"登録番号","名前","ﾌﾘｶﾞﾅ","学年","所属",null,null,"登録番号","姓","名","姓（フリガナ）","名（フリガナ）","学年",null,"このシートに表示されていない選手は、「追加登録選手」シートに入力して下さい"]
[null,{"$f":"IFERROR(VALUE(SUBSTITUTE(I5,\"\"\"\",\"\")),\"\")","v":1},{"$f":"IFERROR(J5&VLOOKUP(5-LEN(J5)-LEN(K5),$C$104:$D$107,2,TRUE)&K5,\"\")","v":"　　　"},{"$f":"IFERROR(ASC(L5)&\" \"&ASC(M5),\"\")","v":" "},{"$f":"IFERROR(RIGHT(N5,1),\"\")","v":""},{"$f":"VLOOKUP(初期設定!$C$4,学校番号!$A$3:$D$50,4,FALSE)","v":{"$error":"#N/A"}},{"$f":"IF(B5=\"\",\"\",C5&\"(\"&E5&\")\")","v":"　　　()"},null,{"$f":"MOD(初期設定!$C$4,100)*100+ROW(男子選手!B1)","v":1},{"$f":"IFERROR(VLOOKUP($I5,追加登録選手!$A$1:$F$1000,COLUMN(男子選手!B1),FALSE),\"\")","v":""},{"$f":"IFERROR(VLOOKUP($I5,追加登録選手!$A$1:$F$1000,COLUMN(男子選手!C1),FALSE),\"\")","v":""},{"$f":"IFERROR(VLOOKUP($I5,追加登録選手!$A$1:$F$1000,COLUMN(男子選手!D1),FALSE),\"\")","v":""},{"$f":"IFERROR(VLOOKUP($I5,追加登録選手!$A$1:$F$1000,COLUMN(男子選手!E1),FALSE),\"\")","v":""},{"$f":"IFERROR(VLOOKUP($I5,追加登録選手!$A$1:$F$1000,COLUMN(男子選手!F1),FALSE),\"\")","v":""}]
[null,{"$f":"IFERROR(VALUE(SUBSTITUTE(I6,\"\"\"\",\"\")),\"\")","v":2},{"$f":"IFERROR(J6&VLOOKUP(5-LEN(J6)-LEN(K6),$C$104:$D$107,2,TRUE)&K6,\"\")","v":"　　　"},{"$f":"IFERROR(ASC(L6)&\" \"&ASC(M6),\"\")","v":" "},{"$f":"IFERROR(RIGHT(N6,1),\"\")","v":""},{"$f":"VLOOKUP(初期設定!$C$4,学校番号!$A$3:$D$50,4,FALSE)","v":{"$error":"#N/A"}},{"$f":"IF(B6=\"\",\"\",C6&\"(\"&E6&\")\")","v":"　　　()"},null,{"$f":"MOD(初期設定!$C$4,100)*100+ROW(男子選手!B2)","v":2},{"$f":"IFERROR(VLOOKUP($I6,追加登録選手!$A$1:$F$1000,COLUMN(男子選手!B2),FALSE),\"\")","v":""},{"$f":"IFERROR(VLOOKUP($I6,追加登録選手!$A$1:$F$1000,COLUMN(男子選手!C2),FALSE),\"\")","v":""},{"$f":"IFERROR(VLOOKUP($I6,追加登録選手!$A$1:$F$1000,COLUMN(男子選手!D2),FALSE),\"\")","v":""},{"$f":"IFERROR(VLOOKUP($I6,追加登録選手!$A$1:$F$1000,COLUMN(男子選手!E2),FALSE),\"\")","v":""},{"$f":"IFERROR(VLOOKUP($I6,追加登録選手!$A$1:$F$1000,COLUMN(男子選手!F2),FALSE),\"\")","v":""}]
[null,3,"　　　"," ","",{"$f":"VLOOKUP(初期設定!$C$4,学校番号!$A$3:$D$50,4,FALSE)","v":{"$error":"#N/A"}},"　　　()",null,{"$f":"MOD(初期設定!$C$4,100)*100+ROW(男子選手!B3)","v":3},{"$f":"IFERROR(VLOOKUP($I7,追加登録選手!$A$1:$F$1000,COLUMN(男子選手!B3),FALSE),\"\")","v":""},{"$f":"IFERROR(VLOOKUP($I7,追加登録選手!$A$1:$F$1000,COLUMN(男子選手!C3),FALSE),\"\")","v":""},{"$f":"IFERROR(VLOOKUP($I7,追加登録選手!$A$1:$F$1000,COLUMN(男子選手!D3),FALSE),\"\")","v":""},{"$f":"IFERROR(VLOOKUP($I7,追加登録選手!$A$1:$F$1000,COLUMN(男子選手!E3),FALSE),\"\")","v":""},{"$f":"IFERROR(VLOOKUP($I7,追加登録選手!$A$1:$F$1000,COLUMN(男子選手!F3),FALSE),\"\")","v":""}]
[null,4,"　　　"," ","",{"$f":"VLOOKUP(初期設定!$C$4,学校番号!$A$3:$D$50,4,FALSE)","v":{"$error":"#N/A"}},"　　　()",null,{"$f":"MOD(初期設定!$C$4,100)*100+ROW(男子選手!B4)","v":4},{"$f":"IFERROR(VLOOKUP($I8,追加登録選手!$A$1:$F$1000,COLUMN(男子選手!B4),FALSE),\"\")","v":""},{"$f":"IFERROR(VLOOKUP($I8,追加登録選手!$A$1:$F$1000,COLUMN(男子選手!C4),FALSE),\"\")","v":""},{"$f":"IFERROR(VLOOKUP($I8,追加登録選手!$A$1:$F$1000,COLUMN(男子選手!D4),FALSE),\"\")","v":""},{"$f":"IFERROR(VLOOKUP($I8,追加登録選手!$A$1:$F$1000,COLUMN(男子選手!E4),FALSE),\"\")","v":""},{"$f":"IFERROR(VLOOKUP($I8,追加登録選手!$A$1:$F$1000,COLUMN(男子選手!F4),FALSE),\"\")","v":""}]
{"$rows_left_out":100}
{"sheet":"記録入力","index":2,"n_rows":87,"n_cols":16,"rows_kept":87,"cut":false,"hidden":false,"merged":[[1,14,2,14],[1,0,2,0],[1,13,2,13],[1,1,2,1],[1,2,2,2],[1,3,2,3],[1,4,2,4],[1,8,2,8],[1,9,2,9],[1,10,2,10],[1,11,2,11],[1,12,2,12]]}
[2,null,3,4,7,8,9,10,12,14,15,16,17,20]
["種目\nコード","学年","種    目","TFC","No","分","秒","1/100","記録","No","氏名","学校名","学校番号",null,"性別"]
[null,null,null,null,null,null,"m","cm"]
["00200","1",{"$f":"VLOOKUP(A4,初期設定!$B$20:$F$40,2,0)","v":"100m"},{"$f":"VLOOKUP(A4,初期設定!$B$20:$F$40,3,0)","v":"01T"},null,null,null,null,{"$f":"IF(AND(F4=\"\",G4=\"\",H4=\"\"),\"\",IF(D4=\"01T\",IF(F4=\"\",G4&\"\"\"\"&H4,F4&\"'\"&G4&\"\"\"\"&H4),IF(D4=\"02F\",G4&\"m\"&H4,H4&\"点\")))","v":""},{"$f":"IF(E4=\"\",\"\",E4)","v":""},{"$f":"IF(ISERROR(VLOOKUP(E4,男子選手!$B$5:$G$195,6,FALSE)),\"\",VLOOKUP(E4,男子選手!$B$5:$G$195,6,FALSE))","v":""},{"$f":"IFERROR(VLOOKUP(E4,男子選手!$B$5:$F$103,5,FALSE),\"\")","v":""},{"$f":"IF(K4=\"\",\"\",初期設定!$C$4)","v":""},{"$f":"CONCATENATE(F4,G4,H4)","v":""},{"$f":"IF(K4=\"\",\"\",\"男\")","v":""},{"$f":"IF(K4=\"\",\"\",IF(MID(K4,LEN(K4)-1,1)=B4,\"OK\",\"学年間違い\"))","v":""}]
["00200","1",{"$f":"VLOOKUP(A5,初期設定!$B$20:$F$40,2,0)","v":"100m"},{"$f":"VLOOKUP(A5,初期設定!$B$20:$F$40,3,0)","v":"01T"},null,null,null,null,"",{"$f":"IF(E5=\"\",\"\",E5)","v":""},{"$f":"IF(ISERROR(VLOOKUP(E5,男子選手!$B$5:$G$195,6,FALSE)),\"\",VLOOKUP(E5,男子選手!$B$5:$G$195,6,FALSE))","v":""},{"$f":"IFERROR(VLOOKUP(E5,男子選手!$B$5:$F$103,5,FALSE),\"\")","v":""},{"$f":"IF(K5=\"\",\"\",初期設定!$C$4)","v":""},{"$f":"CONCATENATE(F5,G5,H5)","v":""},{"$f":"IF(K5=\"\",\"\",\"男\")","v":""},{"$f":"IF(K5=\"\",\"\",IF(MID(K5,LEN(K5)-1,1)=B5,\"OK\",\"学年間違い\"))","v":""}]
["00200","2",{"$f":"VLOOKUP(A6,初期設定!$B$20:$F$40,2,0)","v":"100m"},{"$f":"VLOOKUP(A6,初期設定!$B$20:$F$40,3,0)","v":"01T"},null,null,null,null,{"$f":"IF(AND(F6=\"\",G6=\"\",H6=\"\"),\"\",IF(D6=\"01T\",IF(F6=\"\",G6&\"\"\"\"&H6,F6&\"'\"&G6&\"\"\"\"&H6),IF(D6=\"02F\",G6&\"m\"&H6,H6&\"点\")))","v":""},"",{"$f":"IF(ISERROR(VLOOKUP(E6,男子選手!$B$5:$G$195,6,FALSE)),\"\",VLOOKUP(E6,男子選手!$B$5:$G$195,6,FALSE))","v":""},{"$f":"IFERROR(VLOOKUP(E6,男子選手!$B$5:$F$103,5,FALSE),\"\")","v":""},{"$f":"IF(K6=\"\",\"\",初期設定!$C$4)","v":""},{"$f":"CONCATENATE(F6,G6,H6)","v":""},"",""]
["00200","2",{"$f":"VLOOKUP(A7,初期設定!$B$20:$F$40,2,0)","v":"100m"},{"$f":"VLOOKUP(A7,初期設定!$B$20:$F$40,3,0)","v":"01T"},null,null,null,null,{"$f":"IF(AND(F7=\"\",G7=\"\",H7=\"\"),\"\",IF(D7=\"01T\",IF(F7=\"\",G7&\"\"\"\"&H7,F7&\"'\"&G7&\"\"\"\"&H7),IF(D7=\"02F\",G7&\"m\"&H7,H7&\"点\")))","v":""},{"$f":"IF(E7=\"\",\"\",E7)","v":""},{"$f":"IF(ISERROR(VLOOKUP(E7,男子選手!$B$5:$G$195,6,FALSE)),\"\",VLOOKUP(E7,男子選手!$B$5:$G$195,6,FALSE))","v":""},{"$f":"IFERROR(VLOOKUP(E7,男子選手!$B$5:$F$103,5,FALSE),\"\")","v":""},{"$f":"IF(K7=\"\",\"\",初期設定!$C$4)","v":""},"","",""]
["00300","1",{"$f":"VLOOKUP(A8,初期設定!$B$20:$F$40,2,0)","v":"200m"},{"$f":"VLOOKUP(A8,初期設定!$B$20:$F$40,3,0)","v":"01T"},null,null,null,null,"","",{"$f":"IF(ISERROR(VLOOKUP(E8,男子選手!$B$5:$G$195,6,FALSE)),\"\",VLOOKUP(E8,男子選手!$B$5:$G$195,6,FALSE))","v":""},{"$f":"IFERROR(VLOOKUP(E8,男子選手!$B$5:$F$103,5,FALSE),\"\")","v":""},{"$f":"IF(K8=\"\",\"\",初期設定!$C$4)","v":""},"","",""]
{"$rows_left_out":80}
{"sheet":"男子申込","index":3,"n_rows":74,"n_cols":18,"rows_kept":74,"cut":false,"hidden":false,"merged":[[1,4,1,16],[6,6,6,8],[3,10,3,12],[3,13,3,16],[5,1,6,3],[5,10,6,12],[5,13,6,16],[2,15,2,16],[45,1,50,1],[45,2,47,2],[48,2,50,2],[1,1,1,2],[3,2,3,3],[5,17,6,17],[64,7,64,8],[56,3,56,4],[58,3,58,4],[57,3,57,4],[59,3,59,4],[59,7,59,8],[58,7,58,8],[61,3,61,5],[8,14,8,15],[63,3,63,5],[64,3,64,5],[65,3,65,5],[3,5,3,8],[65,7,65,8],[61,7,61,8],[62,7,62,8],[63,7,63,8],[62,3,62,5],[55,1,55,5],[58,1,58,2],[59,1,59,2],[61,1,65,2],[57,1,57,2],[5,5,5,8],[56,1,56,2],[27,1,44,1],[9,1,26,1]]}
[]
[null,"男  子",null,null,"第76回　兵庫県高等学校ユース陸上競技対校選手権大会地区予選会　申込書"]
[null,null,null,null,null,null,null,null,null,null,null,null,null,null,null,"（様式１）"]
[null,"学校番号",{"$f":"初期設定!C4","v":0},null,"学　校　名",{"$f":"初期設定!$C$2","v":""},null,null,null,null,"学校長氏名",null,null,{"$f":"初期設定!C8","v":0},null,null,null,"印"]
[]
[null,"学校所在地",null,null,{"$f":"CONCATENATE(学校番号!H2,初期設定!C5)","v":"〒"},{"$f":"初期設定!C7","v":""},null,null,null,null,"顧問氏名",null,null,{"$f":"初期設定!C9","v":0},null,null,null,"印"]
[null,null,null,null,null,"℡",{"$f":"初期設定!C6","v":""}]
[]
{"$rows_left_out":67}
{"sheet":"データ貼付","index":4,"n_rows":102,"n_cols":10,"rows_kept":102,"cut":false,"hidden":true,"merged":[]}
[]
[null,null,null,"No.","氏名","種目","種目①","種目②"]
[{"$f":"IF(E2=E3,A2,A2+1)","v":1},{"$f":"IF(I3=\"\",A3*10+J3,A3*10+I3)","v":{"$error":"#VALUE!"}},1,{"$f":"IF(計算①!E1=\"\",\"\",計算①!E1)","v":""},{"$f":"IF(D3=\"\",\"\",計算①!K1)","v":""},{"$f":"IF(D3=\"\",\"\",計算①!C1)","v":""},{"$f":"IF(F3=\"4x100R\",\"\",IF(F3=\"4x400R\",\"\",F3))","v":""},{"$f":"IF(G3=\"\",F3,\"\")","v":""},{"$f":"IF(G3=\"\",\"\",IF(D3=\"\",\"\",IF(D3=D2,I2+1,1)))","v":""},{"$f":"IF(H3=\"4x100R\",4,IF(H3=\"4x400R\",5,\"\"))","v":""}]
[{"$f":"IF(E3=E4,A3,A3+1)","v":1},{"$f":"IF(I4=\"\",A4*10+J4,A4*10+I4)","v":{"$error":"#VALUE!"}},2,{"$f":"IF(計算①!E2=\"\",\"\",計算①!E2)","v":""},{"$f":"IF(D4=\"\",\"\",計算①!K2)","v":""},{"$f":"IF(D4=\"\",\"\",計算①!C2)","v":""},{"$f":"IF(F4=\"4x100R\",\"\",IF(F4=\"4x400R\",\"\",F4))","v":""},{"$f":"IF(G4=\"\",F4,\"\")","v":""},{"$f":"IF(G4=\"\",\"\",IF(D4=\"\",\"\",IF(D4=D3,I3+1,1)))","v":""},{"$f":"IF(H4=\"4x100R\",4,IF(H4=\"4x400R\",5,\"\"))","v":""}]
[1,{"$error":"#VALUE!"},3,{"$f":"IF(計算①!E3=\"\",\"\",計算①!E3)","v":""},{"$f":"IF(D5=\"\",\"\",計算①!K3)","v":""},{"$f":"IF(D5=\"\",\"\",計算①!C3)","v":""},"","","",""]
[1,{"$error":"#VALUE!"},4,{"$f":"IF(計算①!E4=\"\",\"\",計算①!E4)","v":""},{"$f":"IF(D6=\"\",\"\",計算①!K4)","v":""},{"$f":"IF(D6=\"\",\"\",計算①!C4)","v":""},"","","",""]
[1,{"$error":"#VALUE!"},5,{"$f":"IF(計算①!E5=\"\",\"\",計算①!E5)","v":""},{"$f":"IF(D7=\"\",\"\",計算①!K5)","v":""},{"$f":"IF(D7=\"\",\"\",計算①!C5)","v":""},"","","",""]
[1,{"$error":"#VALUE!"},6,{"$f":"IF(計算①!E6=\"\",\"\",計算①!E6)","v":""},{"$f":"IF(D8=\"\",\"\",計算①!K6)","v":""},{"$f":"IF(D8=\"\",\"\",計算①!C6)","v":""},"","","",""]
{"$rows_left_out":95}
{"sheet":"データ完成","index":5,"n_rows":102,"n_cols":11,"rows_kept":102,"cut":false,"hidden":true,"merged":[]}
[]
[null,null,null,null,1,2,3,4,5]
[null,1,{"$f":"VLOOKUP($B3,データ貼付!$A$3:$I$102,4,FALSE)","v":""},{"$f":"VLOOKUP($B3,データ貼付!$A$3:$I$102,5,FALSE)","v":""},{"$f":"IF(ISERROR(VLOOKUP($B3*10+$E$2,データ貼付!$B$3:$F$102,5,FALSE)),\"\",VLOOKUP($B3*10+$E$2,データ貼付!$B$3:$F$102,5,FALSE))","v":""},{"$f":"IF(ISERROR(VLOOKUP($B3*10+$F$2,データ貼付!$B$3:$F$102,5,FALSE)),\"\",VLOOKUP($B3*10+$F$2,データ貼付!$B$3:$F$102,5,FALSE))","v":""},{"$f":"IF(ISERROR(VLOOKUP($B3*10+$G$2,データ貼付!$B$3:$F$102,5,FALSE)),\"\",VLOOKUP($B3*10+$G$2,データ貼付!$B$3:$F$102,5,FALSE))","v":""},{"$f":"IF(ISERROR(VLOOKUP($B3*10+$H$2,データ貼付!$B$3:$F$102,5,FALSE)),\"\",VLOOKUP($B3*10+$H$2,データ貼付!$B$3:$F$102,5,FALSE))","v":""},{"$f":"IF(ISERROR(VLOOKUP($B3*10+$I$2,データ貼付!$B$3:$F$102,5,FALSE)),\"\",VLOOKUP($B3*10+$I$2,データ貼付!$B$3:$F$102,5,FALSE))","v":""},{"$f":"IF(H3=\"\",\"\",\"○\")","v":""},{"$f":"IF(I3=\"\",\"\",\"○\")","v":""}]
[null,2,{"$f":"VLOOKUP($B4,データ貼付!$A$3:$I$102,4,FALSE)","v":{"$error":"#N/A"}},{"$f":"VLOOKUP($B4,データ貼付!$A$3:$I$102,5,FALSE)","v":{"$error":"#N/A"}},{"$f":"IF(ISERROR(VLOOKUP($B4*10+$E$2,データ貼付!$B$3:$F$102,5,FALSE)),\"\",VLOOKUP($B4*10+$E$2,データ貼付!$B$3:$F$102,5,FALSE))","v":""},{"$f":"IF(ISERROR(VLOOKUP($B4*10+$F$2,データ貼付!$B$3:$F$102,5,FALSE)),\"\",VLOOKUP($B4*10+$F$2,データ貼付!$B$3:$F$102,5,FALSE))","v":""},{"$f":"IF(ISERROR(VLOOKUP($B4*10+$G$2,データ貼付!$B$3:$F$102,5,FALSE)),\"\",VLOOKUP($B4*10+$G$2,データ貼付!$B$3:$F$102,5,FALSE))","v":""},{"$f":"IF(ISERROR(VLOOKUP($B4*10+$H$2,データ貼付!$B$3:$F$102,5,FALSE)),\"\",VLOOKUP($B4*10+$H$2,データ貼付!$B$3:$F$102,5,FALSE))","v":""},{"$f":"IF(ISERROR(VLOOKUP($B4*10+$I$2,データ貼付!$B$3:$F$102,5,FALSE)),\"\",VLOOKUP($B4*10+$I$2,データ貼付!$B$3:$F$102,5,FALSE))","v":""},{"$f":"IF(H4=\"\",\"\",\"○\")","v":""},{"$f":"IF(I4=\"\",\"\",\"○\")","v":""}]
[null,3,{"$f":"VLOOKUP($B5,データ貼付!$A$3:$I$102,4,FALSE)","v":{"$error":"#N/A"}},{"$f":"VLOOKUP($B5,データ貼付!$A$3:$I$102,5,FALSE)","v":{"$error":"#N/A"}},{"$f":"IF(ISERROR(VLOOKUP($B5*10+$E$2,データ貼付!$B$3:$F$102,5,FALSE)),\"\",VLOOKUP($B5*10+$E$2,データ貼付!$B$3:$F$102,5,FALSE))","v":""},{"$f":"IF(ISERROR(VLOOKUP($B5*10+$F$2,データ貼付!$B$3:$F$102,5,FALSE)),\"\",VLOOKUP($B5*10+$F$2,データ貼付!$B$3:$F$102,5,FALSE))","v":""},{"$f":"IF(ISERROR(VLOOKUP($B5*10+$G$2,データ貼付!$B$3:$F$102,5,FALSE)),\"\",VLOOKUP($B5*10+$G$2,データ貼付!$B$3:$F$102,5,FALSE))","v":""},{"$f":"IF(ISERROR(VLOOKUP($B5*10+$H$2,データ貼付!$B$3:$F$102,5,FALSE)),\"\",VLOOKUP($B5*10+$H$2,データ貼付!$B$3:$F$102,5,FALSE))","v":""},{"$f":"IF(ISERROR(VLOOKUP($B5*10+$I$2,データ貼付!$B$3:$F$102,5,FALSE)),\"\",VLOOKUP($B5*10+$I$2,データ貼付!$B$3:$F$102,5,FALSE))","v":""},"",""]
[null,4,{"$f":"VLOOKUP($B6,データ貼付!$A$3:$I$102,4,FALSE)","v":{"$error":"#N/A"}},{"$f":"VLOOKUP($B6,データ貼付!$A$3:$I$102,5,FALSE)","v":{"$error":"#N/A"}},{"$f":"IF(ISERROR(VLOOKUP($B6*10+$E$2,データ貼付!$B$3:$F$102,5,FALSE)),\"\",VLOOKUP($B6*10+$E$2,データ貼付!$B$3:$F$102,5,FALSE))","v":""},{"$f":"IF(ISERROR(VLOOKUP($B6*10+$F$2,データ貼付!$B$3:$F$102,5,FALSE)),\"\",VLOOKUP($B6*10+$F$2,データ貼付!$B$3:$F$102,5,FALSE))","v":""},{"$f":"IF(ISERROR(VLOOKUP($B6*10+$G$2,データ貼付!$B$3:$F$102,5,FALSE)),\"\",VLOOKUP($B6*10+$G$2,データ貼付!$B$3:$F$102,5,FALSE))","v":""},{"$f":"IF(ISERROR(VLOOKUP($B6*10+$H$2,データ貼付!$B$3:$F$102,5,FALSE)),\"\",VLOOKUP($B6*10+$H$2,データ貼付!$B$3:$F$102,5,FALSE))","v":""},{"$f":"IF(ISERROR(VLOOKUP($B6*10+$I$2,データ貼付!$B$3:$F$102,5,FALSE)),\"\",VLOOKUP($B6*10+$I$2,データ貼付!$B$3:$F$102,5,FALSE))","v":""},"",""]
[null,5,{"$f":"VLOOKUP($B7,データ貼付!$A$3:$I$102,4,FALSE)","v":{"$error":"#N/A"}},{"$f":"VLOOKUP($B7,データ貼付!$A$3:$I$102,5,FALSE)","v":{"$error":"#N/A"}},{"$f":"IF(ISERROR(VLOOKUP($B7*10+$E$2,データ貼付!$B$3:$F$102,5,FALSE)),\"\",VLOOKUP($B7*10+$E$2,データ貼付!$B$3:$F$102,5,FALSE))","v":""},{"$f":"IF(ISERROR(VLOOKUP($B7*10+$F$2,データ貼付!$B$3:$F$102,5,FALSE)),\"\",VLOOKUP($B7*10+$F$2,データ貼付!$B$3:$F$102,5,FALSE))","v":""},{"$f":"IF(ISERROR(VLOOKUP($B7*10+$G$2,データ貼付!$B$3:$F$102,5,FALSE)),\"\",VLOOKUP($B7*10+$G$2,データ貼付!$B$3:$F$102,5,FALSE))","v":""},{"$f":"IF(ISERROR(VLOOKUP($B7*10+$H$2,データ貼付!$B$3:$F$102,5,FALSE)),\"\",VLOOKUP($B7*10+$H$2,データ貼付!$B$3:$F$102,5,FALSE))","v":""},{"$f":"IF(ISERROR(VLOOKUP($B7*10+$I$2,データ貼付!$B$3:$F$102,5,FALSE)),\"\",VLOOKUP($B7*10+$I$2,データ貼付!$B$3:$F$102,5,FALSE))","v":""},"",""]
[null,6,{"$f":"VLOOKUP($B8,データ貼付!$A$3:$I$102,4,FALSE)","v":{"$error":"#N/A"}},{"$f":"VLOOKUP($B8,データ貼付!$A$3:$I$102,5,FALSE)","v":{"$error":"#N/A"}},{"$f":"IF(ISERROR(VLOOKUP($B8*10+$E$2,データ貼付!$B$3:$F$102,5,FALSE)),\"\",VLOOKUP($B8*10+$E$2,データ貼付!$B$3:$F$102,5,FALSE))","v":""},{"$f":"IF(ISERROR(VLOOKUP($B8*10+$F$2,データ貼付!$B$3:$F$102,5,FALSE)),\"\",VLOOKUP($B8*10+$F$2,データ貼付!$B$3:$F$102,5,FALSE))","v":""},{"$f":"IF(ISERROR(VLOOKUP($B8*10+$G$2,データ貼付!$B$3:$F$102,5,FALSE)),\"\",VLOOKUP($B8*10+$G$2,データ貼付!$B$3:$F$102,5,FALSE))","v":""},{"$f":"IF(ISERROR(VLOOKUP($B8*10+$H$2,データ貼付!$B$3:$F$102,5,FALSE)),\"\",VLOOKUP($B8*10+$H$2,データ貼付!$B$3:$F$102,5,FALSE))","v":""},{"$f":"IF(ISERROR(VLOOKUP($B8*10+$I$2,データ貼付!$B$3:$F$102,5,FALSE)),\"\",VLOOKUP($B8*10+$I$2,データ貼付!$B$3:$F$102,5,FALSE))","v":""},"",""]
{"$rows_left_out":95}
{"sheet":"追加登録選手","index":6,"n_rows":900,"n_cols":6,"rows_kept":900,"cut":false,"hidden":false,"merged":[]}
[160,"杉本","匠斗","スギモト","タクト","高校3"]
[161,"河野","泰地","コウノ","タイチ","高校3"]
[162,"中山","鷹暁","ナカヤマ","タカアキ","高校3"]
[166,"山本","祥慶","ヤマモト","ヨシチカ","高校3"]
[167,"奥屋敷","海斗","オクヤシキ","カイト","高校3"]
[168,"城ケ原","楽人","ジョウガハラ","ラクト","高校2"]
[170,"大橋","優人","オオハシ","マサト","高校2"]
[172,"松田","優輝","マツダ","ユウキ","高校2"]
{"$rows_left_out":893}
{"sheet":"計算①","index":7,"n_rows":0,"n_cols":0,"rows_kept":0,"cut":false,"hidden":false,"merged":[]}

{"sheet":"学校番号","index":8,"n_rows":50,"n_cols":8,"rows_kept":50,"cut":false,"hidden":true,"merged":[]}
[]
[100,null,"ゼッケン",null,null,null,null,"〒"]
[4101,"県立尼崎高等学校",100,"県尼崎","660-0804","尼崎市北大物町18-1","06-6401-0643"]
[4102,"市立尼崎高等学校",200,"市尼崎","661-0014","尼崎市上ノ島町1-38-1","06-6429-0169"]
[4103,"市立尼崎双星高等学校",300,"尼崎双星","661-0983","尼崎市口田中2-8-1","06-6491-7000"]
[4104,"県立尼崎西高等学校",400,"尼崎西","660-0076","尼崎市大島2-34-1","06-6417-5021"]
[4105,"県立尼崎北高等学校",500,"尼崎北","661-0002","尼崎市塚口町5-40-1","06-6421-0132"]
[4106,"県立尼崎稲園高等学校",600,"尼崎稲園","661-0981","尼崎市猪名寺3-1-1","06-6422-0271"]
{"$rows_left_out":43}
{"sheet":"CSV","index":9,"n_rows":110,"n_cols":13,"rows_kept":110,"cut":false,"hidden":true,"merged":[]}
["DB","N1","N2","SX","KC","MC","ZK","S1","400mR","1600mR",{"$f":"28&初期設定!C4","v":"28"},{"$f":"記録入力!N76","v":""},{"$f":"記録入力!N82","v":""}]
[{"$f":"IF(計算①!J1=\"\",\"\",\"128\"&初期設定!$C$4&RIGHT(計算①!J1,2))","v":""},{"$f":"IF(A2=\"\",\"\",計算①!K1)","v":""},{"$f":"IF(A2=\"\",\"\",VLOOKUP(G2,男子選手!$B$5:$E$103,3,FALSE))","v":""},{"$f":"IF(A2=\"\",\"\",1)","v":""},{"$f":"IF(OR(A2=\"\",計算①!B1=\"\"),\"\",28)","v":""},{"$f":"IF(A2=\"\",\"\",\"28\"&初期設定!$C$4)","v":""},{"$f":"IF(A2=\"\",\"\",計算①!J1)","v":""},{"$f":"IF(OR(A2=\"\",LEFT(計算①!A1,1)=\"6\"),\"\",LEFT(計算①!A1,4)&計算①!B1&\" \"&IF(計算①!D1=\"01T\",TEXT(計算①!N1,\"0000000\"),TEXT(計算①!N1,\"00000\")))","v":""},{"$f":"IF(計算①!A1=\"60100\",1,\"\")","v":""},{"$f":"IF(計算①!A1=\"60300\",1,\"\")","v":""}]
[{"$f":"IF(計算①!J2=\"\",\"\",\"128\"&初期設定!$C$4&RIGHT(計算①!J2,2))","v":""},{"$f":"IF(A3=\"\",\"\",計算①!K2)","v":""},{"$f":"IF(A3=\"\",\"\",VLOOKUP(G3,男子選手!$B$5:$E$103,3,FALSE))","v":""},{"$f":"IF(A3=\"\",\"\",1)","v":""},{"$f":"IF(OR(A3=\"\",計算①!B2=\"\"),\"\",28)","v":""},{"$f":"IF(A3=\"\",\"\",\"28\"&初期設定!$C$4)","v":""},{"$f":"IF(A3=\"\",\"\",計算①!J2)","v":""},{"$f":"IF(OR(A3=\"\",LEFT(計算①!A2,1)=\"6\"),\"\",LEFT(計算①!A2,4)&計算①!B2&\" \"&IF(計算①!D2=\"01T\",TEXT(計算①!N2,\"0000000\"),TEXT(計算①!N2,\"00000\")))","v":""},{"$f":"IF(計算①!A2=\"60100\",1,\"\")","v":""},{"$f":"IF(計算①!A2=\"60300\",1,\"\")","v":""}]
[{"$f":"IF(計算①!J3=\"\",\"\",\"128\"&初期設定!$C$4&RIGHT(計算①!J3,2))","v":""},{"$f":"IF(A4=\"\",\"\",計算①!K3)","v":""},{"$f":"IF(A4=\"\",\"\",VLOOKUP(G4,男子選手!$B$5:$E$103,3,FALSE))","v":""},"",{"$f":"IF(OR(A4=\"\",計算①!B3=\"\"),\"\",28)","v":""},{"$f":"IF(A4=\"\",\"\",\"28\"&初期設定!$C$4)","v":""},{"$f":"IF(A4=\"\",\"\",計算①!J3)","v":""},{"$f":"IF(OR(A4=\"\",LEFT(計算①!A3,1)=\"6\"),\"\",LEFT(計算①!A3,4)&計算①!B3&\" \"&IF(計算①!D3=\"01T\",TEXT(計算①!N3,\"0000000\"),TEXT(計算①!N3,\"00000\")))","v":""},{"$f":"IF(計算①!A3=\"60100\",1,\"\")","v":""},{"$f":"IF(計算①!A3=\"60300\",1,\"\")","v":""}]
[{"$f":"IF(計算①!J4=\"\",\"\",\"128\"&初期設定!$C$4&RIGHT(計算①!J4,2))","v":""},{"$f":"IF(A5=\"\",\"\",計算①!K4)","v":""},{"$f":"IF(A5=\"\",\"\",VLOOKUP(G5,男子選手!$B$5:$E$103,3,FALSE))","v":""},"",{"$f":"IF(OR(A5=\"\",計算①!B4=\"\"),\"\",28)","v":""},{"$f":"IF(A5=\"\",\"\",\"28\"&初期設定!$C$4)","v":""},{"$f":"IF(A5=\"\",\"\",計算①!J4)","v":""},{"$f":"IF(OR(A5=\"\",LEFT(計算①!A4,1)=\"6\"),\"\",LEFT(計算①!A4,4)&計算①!B4&\" \"&IF(計算①!D4=\"01T\",TEXT(計算①!N4,\"0000000\"),TEXT(計算①!N4,\"00000\")))","v":""},{"$f":"IF(計算①!A4=\"60100\",1,\"\")","v":""},{"$f":"IF(計算①!A4=\"60300\",1,\"\")","v":""}]
[{"$f":"IF(計算①!J5=\"\",\"\",\"128\"&初期設定!$C$4&RIGHT(計算①!J5,2))","v":""},{"$f":"IF(A6=\"\",\"\",計算①!K5)","v":""},{"$f":"IF(A6=\"\",\"\",VLOOKUP(G6,男子選手!$B$5:$E$103,3,FALSE))","v":""},"",{"$f":"IF(OR(A6=\"\",計算①!B5=\"\"),\"\",28)","v":""},{"$f":"IF(A6=\"\",\"\",\"28\"&初期設定!$C$4)","v":""},{"$f":"IF(A6=\"\",\"\",計算①!J5)","v":""},{"$f":"IF(OR(A6=\"\",LEFT(計算①!A5,1)=\"6\"),\"\",LEFT(計算①!A5,4)&計算①!B5&\" \"&IF(計算①!D5=\"01T\",TEXT(計算①!N5,\"0000000\"),TEXT(計算①!N5,\"00000\")))","v":""},{"$f":"IF(計算①!A5=\"60100\",1,\"\")","v":""},{"$f":"IF(計算①!A5=\"60300\",1,\"\")","v":""}]
[{"$f":"IF(計算①!J6=\"\",\"\",\"128\"&初期設定!$C$4&RIGHT(計算①!J6,2))","v":""},{"$f":"IF(A7=\"\",\"\",計算①!K6)","v":""},{"$f":"IF(A7=\"\",\"\",VLOOKUP(G7,男子選手!$B$5:$E$103,3,FALSE))","v":""},"",{"$f":"IF(OR(A7=\"\",計算①!B6=\"\"),\"\",28)","v":""},{"$f":"IF(A7=\"\",\"\",\"28\"&初期設定!$C$4)","v":""},{"$f":"IF(A7=\"\",\"\",計算①!J6)","v":""},{"$f":"IF(OR(A7=\"\",LEFT(計算①!A6,1)=\"6\"),\"\",LEFT(計算①!A6,4)&計算①!B6&\" \"&IF(計算①!D6=\"01T\",TEXT(計算①!N6,\"0000000\"),TEXT(計算①!N6,\"00000\")))","v":""},{"$f":"IF(計算①!A6=\"60100\",1,\"\")","v":""},{"$f":"IF(計算①!A6=\"60300\",1,\"\")","v":""}]
[{"$f":"IF(計算①!J7=\"\",\"\",\"128\"&初期設定!$C$4&RIGHT(計算①!J7,2))","v":""},{"$f":"IF(A8=\"\",\"\",計算①!K7)","v":""},{"$f":"IF(A8=\"\",\"\",VLOOKUP(G8,男子選手!$B$5:$E$103,3,FALSE))","v":""},"",{"$f":"IF(OR(A8=\"\",計算①!B7=\"\"),\"\",28)","v":""},{"$f":"IF(A8=\"\",\"\",\"28\"&初期設定!$C$4)","v":""},{"$f":"IF(A8=\"\",\"\",計算①!J7)","v":""},{"$f":"IF(OR(A8=\"\",LEFT(計算①!A7,1)=\"6\"),\"\",LEFT(計算①!A7,4)&計算①!B7&\" \"&IF(計算①!D7=\"01T\",TEXT(計算①!N7,\"0000000\"),TEXT(計算①!N7,\"00000\")))","v":""},{"$f":"IF(計算①!A7=\"60100\",1,\"\")","v":""},{"$f":"IF(計算①!A7=\"60300\",1,\"\")","v":""}]
{"$rows_left_out":102}